[Spark] compile error

Fremd-Buildsysteme
seife
Developer
Beiträge: 4189
Registriert: Sonntag 2. November 2003, 12:36

Re: [Spark] compile error

Beitrag von seife »

"make update-neutrino", sonst passen die patches im buildsystem nicht zu den tdt-sourcen.
Wenn sich im tdt git wieder mehr tut, dann mach ich mal einen eigenen branch auf davon, aber bisher ist das noch so zu handhaben.
lintux
Interessierter
Interessierter
Beiträge: 69
Registriert: Montag 13. Februar 2012, 21:10

Re: [Spark] compile error

Beitrag von lintux »

lintux@debian:~/spark/buildsystem-cs$ make preqs
==============================================================================
Cloning neutrino-hd-tripledragon git repo
==============================================================================
mkdir -p /home/lintux/spark/buildsystem-cs/source
cd /home/lintux/spark/buildsystem-cs/source && \
git clone git://gitorious.org/neutrino-hd/neutrino-hd-tripledragon.git neutrino-hd-td
Cloning into 'neutrino-hd-td'...
fatal: The remote end hung up unexpectedly
make: *** [/home/lintux/spark/buildsystem-cs/source/neutrino-hd-td] Fehler 128
lintux@debian:~/spark/buildsystem-cs$ git show --stat | grep commit
commit c376c78f9463356226196122a1c564f926662d49
lintux@debian:~/spark/buildsystem-cs$
Debian...sid
###--- Gott sei Dank, ich bin weg vom Fenster ---###
Wait and see... it's going to be great!
AudioSlyer
Erleuchteter
Erleuchteter
Beiträge: 450
Registriert: Sonntag 28. Juli 2002, 00:18

Re: [Spark] compile error

Beitrag von AudioSlyer »

gerade gebaut, ohne Probleme
lintux
Interessierter
Interessierter
Beiträge: 69
Registriert: Montag 13. Februar 2012, 21:10

Re: [Spark] compile error

Beitrag von lintux »

Husten :gruebel:
Drittversuch bestanden. :gruebel:
lintux@debian:~/spark/buildsystem-cs$ make preqs
==============================================================================
Cloning neutrino-hd-tripledragon git repo
==============================================================================
mkdir -p /home/lintux/spark/buildsystem-cs/source
cd /home/lintux/spark/buildsystem-cs/source && \
git clone git://gitorious.org/neutrino-hd/neutrino-hd-tripledragon.git neutrino-hd-td
Cloning into 'neutrino-hd-td'...
remote: Counting objects: 16802, done.
remote: Compressing objects: 100% (4831/4831), done.
remote: Total 16802 (delta 14264), reused 14403 (delta 11949)
Receiving objects: 100% (16802/16802), 8.90 MiB | 639 KiB/s, done.
Resolving deltas: 100% (14264/14264), done.
mkdir /home/lintux/spark/buildsystem-cs/deps
set -e; cd /home/lintux/spark/buildsystem-cs/source; \
git clone git://gitorious.org/open-duckbox-project-sh4/tdt.git
Cloning into 'tdt'...
remote: Counting objects: 48146, done.
remote: Compressing objects: 100% (18191/18191), done.
remote: Total 48146 (delta 29646), reused 42544 (delta 25240)
Receiving objects: 100% (48146/48146), 54.39 MiB | 952 KiB/s, done.
Resolving deltas: 100% (29646/29646), done.
=== cloning libstb-hal ===
mkdir -p /home/lintux/spark/buildsystem-cs/source
cd /home/lintux/spark/buildsystem-cs/source && \
git clone git://gitorious.org/neutrino-hd/libstb-hal.git libstb-hal
Cloning into 'libstb-hal'...
remote: Counting objects: 859, done.
remote: Compressing objects: 100% (495/495), done.
remote: Total 859 (delta 513), reused 500 (delta 292)
Receiving objects: 100% (859/859), 308.64 KiB, done.
Resolving deltas: 100% (513/513), done.
lintux@debian:~/spark/buildsystem-cs$
Debian...sid
###--- Gott sei Dank, ich bin weg vom Fenster ---###
Wait and see... it's going to be great!
schufti
Einsteiger
Einsteiger
Beiträge: 352
Registriert: Freitag 20. August 2004, 22:33

Re: [Spark] compile error

Beitrag von schufti »

auch bei mir läuft es nun wieder glatt durch :up:

mein Dank an alle Beteiligten!
AudioSlyer
Erleuchteter
Erleuchteter
Beiträge: 450
Registriert: Sonntag 28. Juli 2002, 00:18

Re: [Spark] compile error

Beitrag von AudioSlyer »

Die Quelle von ntfs-3g wird nicht gefunden.
Gruss
doc
Contributor
Beiträge: 1623
Registriert: Donnerstag 10. Januar 2002, 20:03

Re: [Spark] compile error

Beitrag von doc »

Hi Audio, wenn Du direkt einen Git Patch anhängst muss seife das nicht erst zusammensuchen. :wink:
Du hast doch bestimmt schon eine neue URL bei Dir eingebunden.
Na schönen Dank Herr Schwanke!
Ein toller Sommer! :-(
AudioSlyer
Erleuchteter
Erleuchteter
Beiträge: 450
Registriert: Sonntag 28. Juli 2002, 00:18

Re: [Spark] compile error

Beitrag von AudioSlyer »

doc
Contributor
Beiträge: 1623
Registriert: Donnerstag 10. Januar 2002, 20:03

Re: [Spark] compile error

Beitrag von doc »

Danke Audio! :up:

Nun müssen noch die $(NTFS_3G-VER) in $(NTFS_3G_VER) angepasst werden. :wink:
Hatte ich damals unkosequent gemacht. Ich denke das seife das dann noch anpasst.
Na schönen Dank Herr Schwanke!
Ein toller Sommer! :-(
seife
Developer
Beiträge: 4189
Registriert: Sonntag 2. November 2003, 12:36

Re: [Spark] compile error

Beitrag von seife »

Geht jetzt wieder, ein paar "Kleinigkeiten" mussten noch gefixt werden, damit das Paket auch korrekt ist.
AudioSlyer
Erleuchteter
Erleuchteter
Beiträge: 450
Registriert: Sonntag 28. Juli 2002, 00:18

Re: [Spark] compile error

Beitrag von AudioSlyer »

Code: Alles auswählen

patching file player2_191/linux/drivers/media/dvb/stm/dvb/e2_proc/e2_proc_avs.c
Hunk #2 succeeded at 139 with fuzz 1.
patching file player2_191/linux/drivers/media/dvb/stm/dvb/e2_proc/e2_proc_video.c
Hunk #41 FAILED at 1265.
1 out of 47 hunks FAILED -- saving rejects to file player2_191/linux/drivers/media/dvb/stm/dvb/e2_proc/e2_proc_video.c.rej
patching file player2_191/linux/drivers/media/dvb/stm/dvb/e2_proc/e2_proc_vmpeg.c
nur bei mir?
OSi
Interessierter
Interessierter
Beiträge: 58
Registriert: Sonntag 4. Oktober 2009, 01:58
Sonstiges: Belkin F7D3302 mit dd-wrt (kong mod) + ICY BOX als Samba-Share und Client Bridge

Re: [Spark] compile error

Beitrag von OSi »

AudioSlyer hat geschrieben:

Code: Alles auswählen

patching file player2_191/linux/drivers/media/dvb/stm/dvb/e2_proc/e2_proc_avs.c
Hunk #2 succeeded at 139 with fuzz 1.
patching file player2_191/linux/drivers/media/dvb/stm/dvb/e2_proc/e2_proc_video.c
Hunk #41 FAILED at 1265.
1 out of 47 hunks FAILED -- saving rejects to file player2_191/linux/drivers/media/dvb/stm/dvb/e2_proc/e2_proc_video.c.rej
patching file player2_191/linux/drivers/media/dvb/stm/dvb/e2_proc/e2_proc_vmpeg.c
nur bei mir?
Sehe seit Donnerstag den gleichen Fehler
Offtopic: Eine Signatur ist ein Text, der an deine Nachrichten angefügt werden kann. Sie ist auf 255 Zeichen begrenzt.
dietmarw
Contributor
Beiträge: 1833
Registriert: Mittwoch 10. April 2002, 14:39

Re: [Spark] compile error

Beitrag von dietmarw »

ich wollts ja in die mailing liste posten, aber aus der firma geht das nicht..

Code: Alles auswählen

==> Applying Patch: sparkdrivers/0001-import-aotom-from-pinky-s-git.patch
patching file frontcontroller/aotom/aotom_i2csoft.c
patching file frontcontroller/aotom/aotom_i2csoft.h
patching file frontcontroller/aotom/aotom_main.c
patching file frontcontroller/aotom/aotom_main.h
patching file frontcontroller/aotom/aotom_vfd.c
==> Applying Patch: sparkdrivers/0002-import-cec-from-pinky-s-git.patch
patching file Makefile
Hunk #1 succeeded at 221 (offset 8 lines).
patching file cec/Makefile
Hunk #1 FAILED at 6.
1 out of 1 hunk FAILED -- saving rejects to file cec/Makefile.rej
patching file cec/cec_dev.c
patching file cec/cec_main.c
patching file cec/cec_opcodes.c
patching file cec/cec_opcodes_def.h
patching file cec/cec_rc.c
patching file e2_proc/e2_proc_main.c
Hunk #1 FAILED at 621.
1 out of 1 hunk FAILED -- saving rejects to file e2_proc/e2_proc_main.c.rej
make: *** [/home/dietmarw/spark/build/cs-neutrino/build_tmp/driver] Error 1
Download Bereiche für DBox2, TD und Spark Distributionen
http://dietmarw.polsum.net
http://dietmarw.trale.de (r.i.p.)
seife
Developer
Beiträge: 4189
Registriert: Sonntag 2. November 2003, 12:36

Re: [Spark] compile error

Beitrag von seife »

ups.
Hatte ich lokal schon gefixt, aber vergessen zu pushen :-)
dietmarw
Contributor
Beiträge: 1833
Registriert: Mittwoch 10. April 2002, 14:39

Re: [Spark] compile error

Beitrag von dietmarw »

Code: Alles auswählen

marw/spark/build/cs-neutrino/source/neutrino-hd-td/data/encoding.conf /home/dietmarw/spark/build/cs-neutrino/source/neutrino-hd-td/data/tobackup.conf '/home/dietmarw/spark/build/cs-neutrino/build_
tmp/pkg/var/tuxbox/config'
make[4]: Leaving directory `/home/dietmarw/spark/build/cs-neutrino/build_tmp/neutrino-hd-tripledragon/data'
make[3]: Leaving directory `/home/dietmarw/spark/build/cs-neutrino/build_tmp/neutrino-hd-tripledragon/data'
make[2]: Leaving directory `/home/dietmarw/spark/build/cs-neutrino/build_tmp/neutrino-hd-tripledragon/data'
make[2]: Entering directory `/home/dietmarw/spark/build/cs-neutrino/build_tmp/neutrino-hd-tripledragon'
make[3]: Entering directory `/home/dietmarw/spark/build/cs-neutrino/build_tmp/neutrino-hd-tripledragon'
make[3]: Nothing to be done for `install-exec-am'.
make[3]: Nothing to be done for `install-data-am'.
make[3]: Leaving directory `/home/dietmarw/spark/build/cs-neutrino/build_tmp/neutrino-hd-tripledragon'
make[2]: Leaving directory `/home/dietmarw/spark/build/cs-neutrino/build_tmp/neutrino-hd-tripledragon'
make[1]: Leaving directory `/home/dietmarw/spark/build/cs-neutrino/build_tmp/neutrino-hd-tripledragon'
install -D -m 0755 skel-root/common/etc/init.d/start_neutrino /home/dietmarw/spark/build/cs-neutrino/build_tmp/pkg/etc/init.d/start_neutrino
make /home/dietmarw/spark/build/cs-neutrino/build_tmp/pkg/.version
make[1]: Entering directory `/home/dietmarw/spark/build/cs-neutrino'
echo "version=1200`date +%Y%m%d%H%M`"    > /home/dietmarw/spark/build/cs-neutrino/build_tmp/pkg/.version
echo "creator=dietmarw"         >> /home/dietmarw/spark/build/cs-neutrino/build_tmp/pkg/.version
echo "imagename=HD-Neutrino"            >> /home/dietmarw/spark/build/cs-neutrino/build_tmp/pkg/.version
A=neutrino-hd-tripledragon; F=${A#neutrino-hd}; \
        B=`cd /home/dietmarw/spark/build/cs-neutrino/source/neutrino-hd-td; git describe --always --dirty`; \
        C=${B%-dirty}; D=${B#$C}; \
        E=`cd /home/dietmarw/spark/build/cs-neutrino/source/neutrino-hd-td; git tag --contains $C`; \
        test -n "$E" && C="$E"; \
        echo "builddate=$C$D ${F:1}" >> /home/dietmarw/spark/build/cs-neutrino/build_tmp/pkg/.version
echo "homepage=http://gitorious.org/neutrino-hd"        >> /home/dietmarw/spark/build/cs-neutrino/build_tmp/pkg/.version
A=`cd /home/dietmarw/spark/build/cs-neutrino/source/libstb-hal; git describe --always --dirty`; \
        echo "libstbhalver=$A" >> /home/dietmarw/spark/build/cs-neutrino/build_tmp/pkg/.version
make[1]: Leaving directory `/home/dietmarw/spark/build/cs-neutrino'
cp -a /home/dietmarw/spark/build/cs-neutrino/pkgs/control/neutrino-hd /home/dietmarw/spark/build/cs-neutrino/build_tmp/neutrino-hd-control
DEP=`sh4-linux-objdump -p /home/dietmarw/spark/build/cs-neutrino/build_tmp/pkg/bin/neutrino | awk '/NEEDED/{print $2}' | sort` && \
        DEP=`echo $DEP` && \
        DEP="${DEP// /, }" && \
        sed -i "s/@DEP@/$DEP/" /home/dietmarw/spark/build/cs-neutrino/build_tmp/neutrino-hd-control/control
install -p -m 0755 /home/dietmarw/spark/build/cs-neutrino/root/bin/fbshot /home/dietmarw/spark/build/cs-neutrino/build_tmp/pkg/bin/
install: cannot stat `/home/dietmarw/spark/build/cs-neutrino/root/bin/fbshot': No such file or directory
make: *** [neutrino-pkg] Error 1
Download Bereiche für DBox2, TD und Spark Distributionen
http://dietmarw.polsum.net
http://dietmarw.trale.de (r.i.p.)
seife
Developer
Beiträge: 4189
Registriert: Sonntag 2. November 2003, 12:36

Re: [Spark] compile error

Beitrag von seife »

fürs erste einmal "make neutrino" (oder "make fbshot") vor "make neutrino-pkg", richtiger fix kommt später.

Edit: sollte jetzt gefixt sein.
AudioSlyer
Erleuchteter
Erleuchteter
Beiträge: 450
Registriert: Sonntag 28. Juli 2002, 00:18

Re: [Spark] compile error

Beitrag von AudioSlyer »

macht mkfs.jffs2 nur bei mir Probleme?
mkfs.jffs2: error!: skipping device_table entry '/dev/console': no parent directory
!
seife
Developer
Beiträge: 4189
Registriert: Sonntag 2. November 2003, 12:36

Re: [Spark] compile error

Beitrag von seife »

Bei mir gehts.
Hast du mkfs.jffs2 mit "make mtd-utils" gebaut oder irgendeines systemweit installiert?
AudioSlyer
Erleuchteter
Erleuchteter
Beiträge: 450
Registriert: Sonntag 28. Juli 2002, 00:18

Re: [Spark] compile error

Beitrag von AudioSlyer »

Mit make mtd-utils, hmmm. Hab an meiner Umgebung eigentlich gar nichts geändert. Sonst lief es immer durch. Mal suchen...
seife
Developer
Beiträge: 4189
Registriert: Sonntag 2. November 2003, 12:36

Re: [Spark] compile error

Beitrag von seife »

wie ist denn der Aufruf von mkfs.jffs2? Bei mir:

Code: Alles auswählen

echo "/dev/console c 0644 0 0 5 1 0 0 0" > /local/seife/src/pingulux-neutrino/build_tmp/devtable
ln -sf /share/zoneinfo/CET /local/seife/src/pingulux-neutrino/build_tmp/install/etc/localtime # CET is the default in a fresh neutrino install
mkfs.jffs2 -e 0x20000 -p -U -D /local/seife/src/pingulux-neutrino/build_tmp/devtable -d /local/seife/src/pingulux-neutrino/build_tmp/install -o /local/seife/src/pingulux-neutrino/build_tmp/flashroot-spark-201207202050.img
sumtool    -e 0x20000 -p -i /local/seife/src/pingulux-neutrino/build_tmp/flashroot-spark-201207202050.img -o /local/seife/src/pingulux-neutrino/build_tmp/flashroot-spark-201207202050.sum.img
Alternativ mach mal ein Makefile.local mit

Code: Alles auswählen

where:
        type -p mkfs.jffs2
Dann:

Code: Alles auswählen

seife@susi:/local/seife/src/pingulux-neutrino> make where
type -p mkfs.jffs2
/local/seife/src/pingulux-neutrino/host/bin/mkfs.jffs2
Nich dass du eine andere version benutzt, ohne es zu wissen :-)
AudioSlyer
Erleuchteter
Erleuchteter
Beiträge: 450
Registriert: Sonntag 28. Juli 2002, 00:18

Re: [Spark] compile error

Beitrag von AudioSlyer »

Code: Alles auswählen

as@as-ThinkPad-X200:~/seife/buildsystem-cs$ make where
type -p mkfs.jffs2
/home/as/seife/buildsystem-cs/host/bin/mkfs.jffs2
alles richtig...

Code: Alles auswählen

as@as-ThinkPad-X200:~/seife/buildsystem-cs$ /home/as/seife/buildsystem-cs/host/bin/mkfs.jffs2 --version
mkfs.jffs2: error!: revision 1.60

Code: Alles auswählen

as@as-ThinkPad-X200:~/seife/buildsystem-cs$ make flashimage
# copy local/flash/* into the image...
# you can e.g. create local/flash/boot/audio.elf ...
echo "/dev/console c 0644 0 0 5 1 0 0 0" > /home/as/seife/buildsystem-cs/build_tmp/devtable
ln -sf /share/zoneinfo/CET /home/as/seife/buildsystem-cs/build_tmp/install/etc/localtime # CET is the default in a fresh neutrino install
mkfs.jffs2 -e 0x20000 -p -U -D /home/as/seife/buildsystem-cs/build_tmp/devtable -d /home/as/seife/buildsystem-cs/build_tmp/install -o /home/as/seife/buildsystem-cs/build_tmp/flashroot-spark-201207211027.img
mkfs.jffs2: error!: skipping device_table entry '/dev/console': no parent directory!
sumtool    -e 0x20000 -p -i /home/as/seife/buildsystem-cs/build_tmp/flashroot-spark-201207211027.img -o /home/as/seife/buildsystem-cs/build_tmp/flashroot-spark-201207211027.sum.img
cp: Aufruf von stat für „/home/as/seife/buildsystem-cs/build_tmp/uImage“ nicht möglich: Datei oder Verzeichnis nicht gefunden
make: *** [flashimage] Fehler 1
seife
Developer
Beiträge: 4189
Registriert: Sonntag 2. November 2003, 12:36

Re: [Spark] compile error

Beitrag von seife »

Keine Ahnung. Hier und bei anderen gehts, da wird bei dir was komisch sein.
Schau halt mal in den mtd-utils code wie das auf die Idee mit dem Fehler kommt...
AudioSlyer
Erleuchteter
Erleuchteter
Beiträge: 450
Registriert: Sonntag 28. Juli 2002, 00:18

Re: [Spark] compile error

Beitrag von AudioSlyer »

Wieder alles ok.
seife
Developer
Beiträge: 4189
Registriert: Sonntag 2. November 2003, 12:36

Re: [Spark] compile error

Beitrag von seife »

Was wars denn?
dietmarw
Contributor
Beiträge: 1833
Registriert: Mittwoch 10. April 2002, 14:39

Re: [Spark] compile error

Beitrag von dietmarw »

layer 8? :blind
Download Bereiche für DBox2, TD und Spark Distributionen
http://dietmarw.polsum.net
http://dietmarw.trale.de (r.i.p.)

Zurück zu „Buildsysteme allgemein“